Target
Caspase-8
Ligand
BDBM50273926
Substrate
Meas. Tech.
ChEMBL_537869 (CHEMBL990681)
EC50
>5000±n/a nM
Citation
 Smith, GGlaser, MPerumal, MNguyen, QDShan, BArstad, EAboagye, EO Design, synthesis, and biological characterization of a caspase 3/7 selective isatin labeled with 2-[18F]fluoroethylazide. J Med Chem 51:8057-67 (2008)  
Target
Name:
Caspase-8
Synonyms:
Apoptotic cysteine protease CAP4 CASP8 Caspase Caspase-8 subunit p18 FADD-like ICE ICE-like apoptotic protease 5 MCH5 | MORT1-associated CED-3 homolog
Type:
Enzyme
Mol. Mass.:
55373.89
Organism:
Homo sapiens (Human)
Description:
Q14790
Residue:
479
  
Inhibitor
Name:
BDBM50273926
Synonyms:
1-(4-Fluorobenzyl)-5-(pyrrolidine-1-sulfonyl)isatin | CHEMBL461248
Type:
Small organic molecule
Emp. Form.:
C19H17FN2O4S
Mol. Mass.:
388.413
SMILES:
Fc1ccc(CN2C(=O)C(=O)c3cc(ccc23)S(=O)(=O)N2CCCC2)cc1
: