Target
Caspase-3
Ligand
BDBM10331
Substrate
Meas. Tech.
ChEMBL_537865 (CHEMBL990676)
EC50
78.6±n/a nM
Citation
 Smith, GGlaser, MPerumal, MNguyen, QDShan, BArstad, EAboagye, EO Design, synthesis, and biological characterization of a caspase 3/7 selective isatin labeled with 2-[18F]fluoroethylazide. J Med Chem 51:8057-67 (2008)  
Target
Name:
Caspase-3
Synonyms:
Apopain CASP3 CPP-32 Caspase 3 Caspase-3 subunit p17 SCA-1 Yama protein | caspase-3 preproprotein
Type:
Hydrolase; heterotetramer of two heterodimers
Mol. Mass.:
31607.55
Organism:
Homo sapiens (Human)
Description:
Residue:
277
  
Inhibitor
Name:
BDBM10331
Synonyms:
(S)-1-(4-Fluorobenzyl)-5-(2-phenoxymethyl-pyrrolidine-1-sulfonyl)-1H-indole-2,3-dione CHEMBL372607 | Pyrrolidine Isatin Analogue 11c
Type:
Small organic molecule
Emp. Form.:
C26H23FN2O5S
Mol. Mass.:
494.535
SMILES:
Fc1ccc(CN2C(=O)C(=O)c3cc(ccc23)S(=O)(=O)N2CCC[C@H]2COc2ccccc2)cc1
: