Target
Cytochrome P450 2C9
Ligand
BDBM50273789
Substrate
Meas. Tech.
ChEMBL_561228 (CHEMBL1012774)
Ki
1890±n/a nM
Citation
 Peng, CCCape, JLRushmore, TCrouch, GJJones, JP Cytochrome P450 2C9 type II binding studies on quinoline-4-carboxamide analogues. J Med Chem 51:8000-11 (2008)  
Target
Name:
Cytochrome P450 2C9
Synonyms:
(R)-limonene 6-monooxygenase CP2C9_HUMAN CYP2C9 Cytochrome P450 2C9 (CYP2C9 ) P-450MP P450 PB-1 | S-mephenytoin 4-hydroxylase
Type:
Enzyme
Mol. Mass.:
55636.33
Organism:
Homo sapiens (Human)
Description:
P11712
Residue:
490
  
Inhibitor
Name:
BDBM50273789
Synonyms:
6-Chloro-N-(naphthalen-2-yl)-2-(pyridin-3-yl)quinoline-4-carboxamide | CHEMBL455974
Type:
Small organic molecule
Emp. Form.:
C25H16ClN3O
Mol. Mass.:
409.867
SMILES:
Clc1ccc2nc(cc(C(=O)Nc3ccc4ccccc4c3)c2c1)-c1cccnc1
: