Target
Hydroxysteroid 11-beta dehydrogenase 1
Ligand
BDBM50273458
Substrate
Meas. Tech.
ChEMBL_561246 (CHEMBL1013601)
IC50
45±n/a nM
Citation
 Fotsch, CBartberger, MDBercot, EAChen, MCupples, REmery, MFretland, JGuram, AHale, CHan, NHickman, DHungate, RWHayashi, MKomorowski, RLiu, QMatsumoto, GSt Jean, DJUrsu, SVéniant, MXu, GYe, QYuan, CZhang, JZhang, XTu, HWang, M Further studies with the 2-amino-1,3-thiazol-4(5H)-one class of 11beta-hydroxysteroid dehydrogenase type 1 inhibitors: reducing pregnane X receptor activity and exploring activity in a monkey pharmacodynamic model. J Med Chem 51:7953-67 (2008)  
Target
Name:
Hydroxysteroid 11-beta dehydrogenase 1
Synonyms:
11-beta-hydroxysteroid dehydrogenase type 1
Type:
PROTEIN
Mol. Mass.:
32020.70
Organism:
Canis familiaris
Description:
ChEMBL_850498
Residue:
293
  
Inhibitor
Name:
BDBM50273458
Synonyms:
(5S)-2-{[(1S)-1-(4-fluorophenyl)ethyl]amino}-5-(1-hydroxy-1-methylethyl)-5-methyl-1,3-thiazol-4(5H)-one CHEMBL455907
Type:
Small organic molecule
Emp. Form.:
C15H19FN2O2S
Mol. Mass.:
310.387
SMILES:
C[C@H](NC1=NC(=O)[C@@](C)(S1)C(C)(C)O)c1ccc(F)cc1
: