Target
Vasopressin V2 receptor
Ligand
BDBM50246958
Substrate
Meas. Tech.
ChEMBL_560999 (CHEMBL1015239)
EC50
10±n/a nM
Citation
 Yea, CMAllan, CEAshworth, DMBarnett, JBaxter, AJBroadbridge, JDFranklin, RJHampton, SLHudson, PHorton, JAJenkins, PDPenson, AMPitt, GRRivière, PRobson, PARooker, DPSemple, GSheppard, AHaigh, RMRoe, MB New benzylureas as a novel series of potent, nonpeptidic vasopressin V2 receptor agonists. J Med Chem 51:8124-34 (2008)  
Target
Name:
Vasopressin V2 receptor
Synonyms:
ADHR AVPR2 DIR Renal-type arginine vasopressin receptor V2R_HUMAN Vasopressin V2 receptor | Vasopressin receptor
Type:
Receptor
Mol. Mass.:
40295.28
Organism:
Homo sapiens (Human)
Description:
P30518
Residue:
371
  
Inhibitor
Name:
BDBM50246958
Synonyms:
1-(4-[3-(2,6-Difluorophenyl)ureidomethyl]-3-ethylbenzoyl)-2,3,4,5-tetrahydro-1H-1-benzazepine | CHEMBL507816
Type:
Small organic molecule
Emp. Form.:
C27H27F2N3O2
Mol. Mass.:
463.519
SMILES:
CCc1cc(ccc1CNC(=O)Nc1c(F)cccc1F)C(=O)N1CCCCc2ccccc12
: