Target
Vasopressin V2 receptor
Ligand
BDBM50247101
Substrate
Meas. Tech.
ChEMBL_560999 (CHEMBL1015239)
EC50
100±n/a nM
Citation
 Yea, CMAllan, CEAshworth, DMBarnett, JBaxter, AJBroadbridge, JDFranklin, RJHampton, SLHudson, PHorton, JAJenkins, PDPenson, AMPitt, GRRivière, PRobson, PARooker, DPSemple, GSheppard, AHaigh, RMRoe, MB New benzylureas as a novel series of potent, nonpeptidic vasopressin V2 receptor agonists. J Med Chem 51:8124-34 (2008)  
Target
Name:
Vasopressin V2 receptor
Synonyms:
ADHR AVPR2 DIR Renal-type arginine vasopressin receptor V2R_HUMAN Vasopressin V2 receptor | Vasopressin receptor
Type:
Receptor
Mol. Mass.:
40295.28
Organism:
Homo sapiens (Human)
Description:
P30518
Residue:
371
  
Inhibitor
Name:
BDBM50247101
Synonyms:
1-(4-[N-(2-Pyrrolidin-1-yl-2-oxoethylcarbamoyl]aminomethyl]-3-methylbenzoyl)-2,3,4,5-tetrahydro-1H-1-benzazepine | CHEMBL516629
Type:
Small organic molecule
Emp. Form.:
C26H32N4O3
Mol. Mass.:
448.5573
SMILES:
Cc1cc(ccc1CNC(=O)NCC(=O)N1CCCC1)C(=O)N1CCCCc2ccccc12
: