Target
Sodium-dependent serotonin transporter
Ligand
BDBM50241199
Substrate
Meas. Tech.
ChEMBL_561312 (CHEMBL1017073)
Ki
0.08±n/a nM
Citation
 Stehouwer, JSJarkas, NZeng, FVoll, RJWilliams, LCamp, VMMalveaux, EJVotaw, JRHowell, LOwens, MJGoodman, MM Synthesis, radiosynthesis, and biological evaluation of fluorine-18-labeled 2beta-carbo(fluoroalkoxy)-3beta-(3'-((Z)-2-haloethenyl)phenyl)nortropanes: candidate radioligands for in vivo imaging of the serotonin transporter with positron emission tomography. J Med Chem 51:7788-99 (2008)  
Target
Name:
Sodium-dependent serotonin transporter
Synonyms:
5-HT Transporter 5HTT SC6A4_HUMAN SLC6A4 Serotonin transporter (5HTT) Sodium-dependent serotonin transporter (SERT) | Solute carrier family 6 member 4
Type:
Multi-pass membrane protein
Mol. Mass.:
70322.51
Organism:
Homo sapiens (Human)
Description:
P31645
Residue:
630
  
Inhibitor
Name:
BDBM50241199
Synonyms:
(Z)-2-[18F]fluoroethyl 3-(4-(2-iodovinyl)phenyl)-8-methyl-8-aza-bicyclo[3.2.1]octane-2-carboxylate CHEMBL395998
Type:
Small organic molecule
Emp. Form.:
C18H21FINO2
Mol. Mass.:
429.2677
SMILES:
FCCOC(=O)C1C2CCC(CC1c1ccc(\C=C/I)cc1)N2
: