Target
D(1A) dopamine receptor
Ligand
BDBM84636
Substrate
Meas. Tech.
ChEMBL_559995 (CHEMBL1018745)
Ki
699±n/a nM
Citation
 Si, YGChoi, YKGardner, MPTarazi, FIBaldessarini, RJNeumeyer, JL Synthesis and neuropharmacological evaluation of esters of R(-)-N-alkyl-11-hydroxy-2-methoxynoraporphines. Bioorg Med Chem Lett 19:51-3 (2008)  
Target
Name:
D(1A) dopamine receptor
Synonyms:
DOPAMINE D1 Dopamine D1 high Dopamine receptor Dopamine1-like Drd1a
Type:
Enzyme Catalytic Domain
Mol. Mass.:
49429.75
Organism:
RAT
Description:
P18901
Residue:
446
  
Inhibitor
Name:
BDBM84636
Synonyms:
CHEMBL27559 | NPA-11-OH-R,(+)
Type:
Small organic molecule
Emp. Form.:
C19H21NO
Mol. Mass.:
279.3761
SMILES:
CCCN1CCc2cccc-3c2[C@H]1Cc1cccc(O)c-31
: