Target
Adenosine receptor A2a
Ligand
BDBM50266019
Substrate
Meas. Tech.
ChEMBL_540180 (CHEMBL1029809)
Ki
64±n/a nM
Citation
 Cole, AGStauffer, TMRokosz, LLMetzger, ADillard, LWZeng, WHenderson, I Synthesis of 2-amino-5-benzoyl-4-(2-furyl)thiazoles as adenosine A(2A) receptor antagonists. Bioorg Med Chem Lett 19:378-81 (2008)  
Target
Name:
Adenosine receptor A2a
Synonyms:
A2A adenosine receptor (hA2A) ADENOSINE A2 ADORA2 Adenosine A2A receptor (A2AAR)
Type:
G Protein-Coupled Receptor (GPCR)
Mol. Mass.:
44716.46
Organism:
Homo sapiens (Human)
Description:
P29274
Residue:
412
  
Inhibitor
Name:
BDBM50266019
Synonyms:
(2-(3,4-difluorobenzylamino)-4-(furan-2-yl)thiazol-5-yl)(phenyl)methanone | CHEMBL465171
Type:
Small organic molecule
Emp. Form.:
C21H14F2N2O2S
Mol. Mass.:
396.41
SMILES:
Fc1ccc(CNc2nc(-c3ccco3)c(s2)C(=O)c2ccccc2)cc1F
: