Target
Arylamine N-acetyltransferase 2
Ligand
BDBM50275025
Substrate
Meas. Tech.
ChEMBL_494097 (CHEMBL942269)
IC50
10100±n/a nM
Citation
 Russell, AJWestwood, IMCrawford, MHRobinson, JKawamura, ARedfield, CLaurieri, NLowe, EDDavies, SGSim, E Selective small molecule inhibitors of the potential breast cancer marker, human arylamine N-acetyltransferase 1, and its murine homologue, mouse arylamine N-acetyltransferase 2. Bioorg Med Chem 17:905-18 (2009)  
Target
Name:
Arylamine N-acetyltransferase 2
Synonyms:
ARY2_MOUSE Nat2
Type:
PROTEIN
Mol. Mass.:
33697.98
Organism:
Mus musculus
Description:
ChEMBL_1347887
Residue:
290
  
Inhibitor
Name:
BDBM50275025
Synonyms:
(Z)-3-Amino-5-(4'-hydroxybenzylidene)-2-thioxothiazolidin-4-one | CHEMBL508577
Type:
Small organic molecule
Emp. Form.:
C10H8N2O2S2
Mol. Mass.:
252.313
SMILES:
NN1C(=S)S\C(=C/c2ccc(O)cc2)C1=O
: