Target
Adenosine receptor A2a
Ligand
BDBM50254008
Substrate
Meas. Tech.
ChEMBL_560532 (CHEMBL1021382)
Ki
2.5±n/a nM
Citation
 Gillespie, RJBamford, SJBotting, RComer, MDenny, SGaur, SGriffin, MJordan, AMKnight, ARLerpiniere, JLeonardi, SLightowler, SMcAteer, SMerrett, AMisra, APadfield, AReece, MSaadi, MSelwood, DLStratton, GCSurry, DTodd, RTong, XRuston, VUpton, RWeiss, SM Antagonists of the human A(2A) adenosine receptor. 4. Design, synthesis, and preclinical evaluation of 7-aryltriazolo[4,5-d]pyrimidines. J Med Chem 52:33-47 (2009)  
Target
Name:
Adenosine receptor A2a
Synonyms:
A2A adenosine receptor (hA2A) ADENOSINE A2 ADORA2 Adenosine A2A receptor (A2AAR)
Type:
G Protein-Coupled Receptor (GPCR)
Mol. Mass.:
44716.46
Organism:
Homo sapiens (Human)
Description:
P29274
Residue:
412
  
Inhibitor
Name:
BDBM50254008
Synonyms:
3-(3-Aminobenzyl)-7-(2-furyl)-3H-[1,2,3]triazolo[4,5-d]pyrimidine-5-amine | CHEMBL461008
Type:
Small organic molecule
Emp. Form.:
C15H13N7O
Mol. Mass.:
307.31
SMILES:
Nc1cccc(Cn2nnc3c(nc(N)nc23)-c2ccco2)c1
: