Target
D(3) dopamine receptor
Ligand
BDBM50275199
Substrate
Meas. Tech.
ChEMBL_494292 (CHEMBL938624)
Ki
658±n/a nM
Citation
 Leopoldo, MLacivita, EDe Giorgio, PContino, MBerardi, FPerrone, R Design, synthesis, and binding affinities of potential positron emission tomography (PET) ligands with optimal lipophilicity for brain imaging of the dopamine D3 receptor. Part II. Bioorg Med Chem 17:758-66 (2009)  
Target
Name:
D(3) dopamine receptor
Synonyms:
DOPAMINE D3 DRD3_HUMAN Dopamine D3 receptor (D3) Dopamine receptor Dopamine receptor D3
Type:
Mol. Mass.:
44243.43
Organism:
Homo sapiens (Human)
Description:
Residue:
400
  
Inhibitor
Name:
BDBM50275199
Synonyms:
CHEMBL458354 | N-[4-[4-(3-Fluoro-5-methoxyphenyl)piperazin-1-yl]butyl]-2,1,3-benzoxadiazole-5-carboxamide
Type:
Small organic molecule
Emp. Form.:
C22H26FN5O3
Mol. Mass.:
427.4719
SMILES:
COc1cc(F)cc(c1)N1CCN(CCCCNC(=O)c2ccc3nonc3c2)CC1
: