Target
Integrin alpha-V
Ligand
BDBM50277095
Substrate
Meas. Tech.
ChEMBL_540407 (CHEMBL1026539)
IC50
180±n/a nM
Citation
 Letourneau, JJLiu, JOhlmeyer, MHRiviello, CRong, YLi, HAppell, KCBansal, SJacob, BWong, AWebb, ML Synthesis and initial evaluation of novel, non-peptidic antagonists of the alpha(v)-integrins alpha(v)beta(3) and alpha(v)beta(5). Bioorg Med Chem Lett 19:352-5 (2008)  
Target
Name:
Integrin alpha-V
Synonyms:
ITAV_HUMAN Integrin alpha-V/alpha-5 VNRA Vitronectin receptor | Vitronectin receptor subunit alpha
Type:
PROTEIN
Mol. Mass.:
116024.92
Organism:
Homo sapiens (Human)
Description:
ChEMBL_582336
Residue:
1048
  
Inhibitor
Name:
BDBM50277095
Synonyms:
3-(5-(2-amino-1-methyl-1H-benzo[d]imidazol-4-yloxy)-1-oxoisoindolin-2-yl)propanoic acid | CHEMBL464398
Type:
Small organic molecule
Emp. Form.:
C19H18N4O4
Mol. Mass.:
366.3706
SMILES:
Cn1c(N)nc2c(Oc3ccc4C(=O)N(CCC(O)=O)Cc4c3)cccc12
: