Target
Sphingosine 1-phosphate receptor 4
Ligand
BDBM50277148
Substrate
Meas. Tech.
ChEMBL_540420 (CHEMBL1029037)
IC50
4±n/a nM
Citation
 Evindar, GBernier, SGKavarana, MJDoyle, ELorusso, JKelley, MSHalley, KHutchings, AWright, ADSaha, AKHannig, GMorgan, BAWestlin, WF Synthesis and evaluation of alkoxy-phenylamides and alkoxy-phenylimidazoles as potent sphingosine-1-phosphate receptor subtype-1 agonists. Bioorg Med Chem Lett 19:369-72 (2008)  
Target
Name:
Sphingosine 1-phosphate receptor 4
Synonyms:
EDG6 S1P receptor 4 S1P4 S1PR4_HUMAN Sphingosine 1-phosphate receptor Edg-6 sphingosine-1-phosphate 4 S1P4
Type:
G Protein-Coupled Receptor (GPCR)
Mol. Mass.:
41647.39
Organism:
Homo sapiens (Human)
Description:
Residue:
384
  
Inhibitor
Name:
BDBM50277148
Synonyms:
(S)-2-amino-2-methyl-3-(4-(octyloxy)phenylamino)-3-oxopropyl dihydrogen phosphate | CHEMBL475495
Type:
Small organic molecule
Emp. Form.:
C18H31N2O6P
Mol. Mass.:
402.4223
SMILES:
CCCCCCCCOc1ccc(NC(=O)[C@@](C)(N)COP(O)(O)=O)cc1
: