Target
Sphingosine 1-phosphate receptor 5
Ligand
BDBM50277149
Substrate
Meas. Tech.
ChEMBL_540421 (CHEMBL1029038)
IC50
6.9±n/a nM
Citation
 Evindar, GBernier, SGKavarana, MJDoyle, ELorusso, JKelley, MSHalley, KHutchings, AWright, ADSaha, AKHannig, GMorgan, BAWestlin, WF Synthesis and evaluation of alkoxy-phenylamides and alkoxy-phenylimidazoles as potent sphingosine-1-phosphate receptor subtype-1 agonists. Bioorg Med Chem Lett 19:369-72 (2008)  
Target
Name:
Sphingosine 1-phosphate receptor 5
Synonyms:
EDG8 S1P5 S1PR5_HUMAN Sphingosine 1-phosphate receptor Edg-8
Type:
G Protein-Coupled Receptor (GPCR)
Mol. Mass.:
41796.42
Organism:
Homo sapiens (Human)
Description:
Residue:
398
  
Inhibitor
Name:
BDBM50277149
Synonyms:
(S)-2-amino-3-(3-fluoro-4-(octyloxy)phenylamino)-2-methyl-3-oxopropyl dihydrogen phosphate | CHEMBL515921
Type:
Small organic molecule
Emp. Form.:
C18H30FN2O6P
Mol. Mass.:
420.4128
SMILES:
CCCCCCCCOc1ccc(NC(=O)[C@@](C)(N)COP(O)(O)=O)cc1F
: