Target
Sphingosine 1-phosphate receptor 3
Ligand
BDBM50277185
Substrate
Meas. Tech.
ChEMBL_540424 (CHEMBL1029041)
EC50
9.8±n/a nM
Citation
 Evindar, GBernier, SGKavarana, MJDoyle, ELorusso, JKelley, MSHalley, KHutchings, AWright, ADSaha, AKHannig, GMorgan, BAWestlin, WF Synthesis and evaluation of alkoxy-phenylamides and alkoxy-phenylimidazoles as potent sphingosine-1-phosphate receptor subtype-1 agonists. Bioorg Med Chem Lett 19:369-72 (2008)  
Target
Name:
Sphingosine 1-phosphate receptor 3
Synonyms:
C9orf108 EDG3 S1P receptor 3 S1P3 S1PR3_HUMAN Sphingosine 1-phosphate receptor 3 (S1P3) | Sphingosine 1-phosphate receptor Edg-3
Type:
G Protein-Coupled Receptor (GPCR)
Mol. Mass.:
42278.13
Organism:
Homo sapiens (Human)
Description:
Q99500
Residue:
378
  
Inhibitor
Name:
BDBM50277185
Synonyms:
(S)-2-amino-3-(2-fluoro-4-(octyloxy)phenylamino)-2-methyl-3-oxopropyl dihydrogen phosphate | CHEMBL474688
Type:
Small organic molecule
Emp. Form.:
C18H30FN2O6P
Mol. Mass.:
420.4128
SMILES:
CCCCCCCCOc1ccc(NC(=O)[C@@](C)(N)COP(O)(O)=O)c(F)c1
: