Target
Sphingosine 1-phosphate receptor 1
Ligand
BDBM50277186
Substrate
Meas. Tech.
ChEMBL_540423 (CHEMBL1029040)
EC50
0.55±n/a nM
Citation
 Evindar, GBernier, SGKavarana, MJDoyle, ELorusso, JKelley, MSHalley, KHutchings, AWright, ADSaha, AKHannig, GMorgan, BAWestlin, WF Synthesis and evaluation of alkoxy-phenylamides and alkoxy-phenylimidazoles as potent sphingosine-1-phosphate receptor subtype-1 agonists. Bioorg Med Chem Lett 19:369-72 (2008)  
Target
Name:
Sphingosine 1-phosphate receptor 1
Synonyms:
CHEDG1 Endothelial differentiation G-protein coupled receptor 1 S1P1 S1PR1_HUMAN Sphingosine 1-phosphate receptor Edg-1
Type:
Enzyme
Mol. Mass.:
42836.02
Organism:
Homo sapiens (Human)
Description:
P21453
Residue:
382
  
Inhibitor
Name:
BDBM50277186
Synonyms:
(R)-2-amino-2-(4-(4-(octyloxy)phenyl)-1H-imidazol-2-yl)propyl dihydrogen phosphate | CHEMBL474689
Type:
Small organic molecule
Emp. Form.:
C20H32N3O5P
Mol. Mass.:
425.4589
SMILES:
CCCCCCCCOc1ccc(cc1)-c1c[nH]c(n1)[C@@](C)(N)COP(O)(O)=O
: