Target
Sphingosine 1-phosphate receptor 4
Ligand
BDBM50277187
Substrate
Meas. Tech.
ChEMBL_540420 (CHEMBL1029037)
IC50
1.9±n/a nM
Citation
 Evindar, GBernier, SGKavarana, MJDoyle, ELorusso, JKelley, MSHalley, KHutchings, AWright, ADSaha, AKHannig, GMorgan, BAWestlin, WF Synthesis and evaluation of alkoxy-phenylamides and alkoxy-phenylimidazoles as potent sphingosine-1-phosphate receptor subtype-1 agonists. Bioorg Med Chem Lett 19:369-72 (2008)  
Target
Name:
Sphingosine 1-phosphate receptor 4
Synonyms:
EDG6 S1P receptor 4 S1P4 S1PR4_HUMAN Sphingosine 1-phosphate receptor Edg-6 sphingosine-1-phosphate 4 S1P4
Type:
G Protein-Coupled Receptor (GPCR)
Mol. Mass.:
41647.39
Organism:
Homo sapiens (Human)
Description:
Residue:
384
  
Inhibitor
Name:
BDBM50277187
Synonyms:
(R)-2-amino-2-(4-(3-fluoro-4-(octyloxy)phenyl)-1H-imidazol-2-yl)propyl dihydrogen phosphate | CHEMBL473269
Type:
Small organic molecule
Emp. Form.:
C20H31FN3O5P
Mol. Mass.:
443.4494
SMILES:
CCCCCCCCOc1ccc(cc1F)-c1c[nH]c(n1)[C@@](C)(N)COP(O)(O)=O
: