Target
Phospholipase A2, membrane associated
Ligand
BDBM50247069
Substrate
Meas. Tech.
ChEMBL_557558 (CHEMBL955001)
IC50
52500±n/a nM
Citation
 Wei, DJiang, XZhou, LChen, JChen, ZHe, CYang, KLiu, YPei, JLai, L Discovery of multitarget inhibitors by combining molecular docking with common pharmacophore matching. J Med Chem 51:7882-8 (2008)  
Target
Name:
Phospholipase A2, membrane associated
Synonyms:
GIIC sPLA2 NPS-PLA2 Non-pancreatic secretory phospholipase A2 (hnps-PLA2) PLA2B PLA2L Phospholipase A2 group IIA | RASF-A
Type:
Hydrolase
Mol. Mass.:
16101.20
Organism:
Homo sapiens (Human)
Description:
The human nps PLA2 was cloned, and expressed in E. coli. There was a refolding process in the purification.
Residue:
144
  
Inhibitor
Name:
BDBM50247069
Synonyms:
2-(7-(benzyloxy)-1H-indol-3-yl)ethanamine | CHEMBL460302
Type:
Small organic molecule
Emp. Form.:
C17H18N2O
Mol. Mass.:
266.3376
SMILES:
NCCc1c[nH]c2c(OCc3ccccc3)cccc12
: