Target
Cannabinoid receptor 2
Ligand
BDBM50277339
Substrate
Meas. Tech.
ChEMBL_540514 (CHEMBL1031455)
EC50
11±n/a nM
Citation
 Goodman, AJAjello, CWWorm, KLe Bourdonnec, BSavolainen, MAO'Hare, HCassel, JAStabley, GJDehaven, RNLabuda, CJKoblish, MLittle, PJBrogdon, BLSmith, SADolle, RE CB2 selective sulfamoyl benzamides: optimization of the amide functionality. Bioorg Med Chem Lett 19:309-13 (2008)  
Target
Name:
Cannabinoid receptor 2
Synonyms:
CANNABINOID CB2 CB2 CB2B CNR2_HUMAN Cannabinoid CB2 receptor Cannabinoid receptor 2 (CB2R) | hCB2
Type:
G Protein-Coupled Receptor (GPCR)
Mol. Mass.:
39690.94
Organism:
Homo sapiens (Human)
Description:
P34972
Residue:
360
  
Inhibitor
Name:
BDBM50277339
Synonyms:
2,2,3,3-tetramethyl-N-(4-methyl-3-(morpholinosulfonyl)phenyl)cyclopropanecarboxamide | CHEMBL472856
Type:
Small organic molecule
Emp. Form.:
C19H28N2O4S
Mol. Mass.:
380.502
SMILES:
Cc1ccc(NC(=O)C2C(C)(C)C2(C)C)cc1S(=O)(=O)N1CCOCC1
: