Target
Cannabinoid receptor 2
Ligand
BDBM50277152
Substrate
Meas. Tech.
ChEMBL_540512 (CHEMBL1030616)
Ki
1.7±n/a nM
Citation
 Goodman, AJAjello, CWWorm, KLe Bourdonnec, BSavolainen, MAO'Hare, HCassel, JAStabley, GJDehaven, RNLabuda, CJKoblish, MLittle, PJBrogdon, BLSmith, SADolle, RE CB2 selective sulfamoyl benzamides: optimization of the amide functionality. Bioorg Med Chem Lett 19:309-13 (2008)  
Target
Name:
Cannabinoid receptor 2
Synonyms:
CANNABINOID CB2 CB2 CB2B CNR2_HUMAN Cannabinoid CB2 receptor Cannabinoid receptor 2 (CB2R) | hCB2
Type:
G Protein-Coupled Receptor (GPCR)
Mol. Mass.:
39690.94
Organism:
Homo sapiens (Human)
Description:
P34972
Residue:
360
  
Inhibitor
Name:
BDBM50277152
Synonyms:
(1S,2S,4R)-1,3,3-trimethyl-N-(4-methyl-3-(morpholinosulfonyl)phenyl)bicyclo[2.2.1]heptane-2-carboxamide | CHEMBL515090
Type:
Small organic molecule
Emp. Form.:
C22H32N2O4S
Mol. Mass.:
420.565
SMILES:
Cc1ccc(NC(=O)[C@H]2[C@@]3(C)CC[C@H](C3)C2(C)C)cc1S(=O)(=O)N1CCOCC1
: