Target
Amine oxidase [flavin-containing] B
Ligand
BDBM50247700
Substrate
Meas. Tech.
ChEMBL_495007 (CHEMBL997737)
Ki
69570±n/a nM
Citation
 Gökhan-Kelekçi, NKoyunoqlu, SYabanoqlu, SYesilada, KOzgen, OUçar, GErol, KKendi, EYesilada, A New pyrazoline bearing 4(3H)-quinazolinone inhibitors of monoamine oxidase: synthesis, biological evaluation, and structural determinants of MAO-A and MAO-B selectivity. Bioorg Med Chem 17:675-89 (2009)  
Target
Name:
Amine oxidase [flavin-containing] B
Synonyms:
AOFB_RAT Amine oxidase [flavin-containing] B Monoamine Oxidase Type B (MAO-B) Monoamine oxidase B (MAO-B) Monoamine oxidase type B (MAOB) | Monoamine oxidase-B (MAO-B)
Type:
Enzyme
Mol. Mass.:
58469.65
Organism:
Rattus norvegicus (rat)
Description:
P19643
Residue:
520
  
Inhibitor
Name:
BDBM50247700
Synonyms:
2-[1'-Phenyl-3'-(4-bromophenyl)-2'-propenylidene]hydrazine-3-methyl)-4(3H)-quinazolinone | CHEMBL510153
Type:
Small organic molecule
Emp. Form.:
C24H19BrN4O
Mol. Mass.:
459.338
SMILES:
Cn1c(N=NC(=CCc2ccc(Br)cc2)c2ccccc2)nc2ccccc2c1=O
: