Target
Amine oxidase [flavin-containing] A
Ligand
BDBM50247672
Substrate
Meas. Tech.
ChEMBL_495010 (CHEMBL997740)
Ki
30160±n/a nM
Citation
 Gökhan-Kelekçi, NKoyunoqlu, SYabanoqlu, SYesilada, KOzgen, OUçar, GErol, KKendi, EYesilada, A New pyrazoline bearing 4(3H)-quinazolinone inhibitors of monoamine oxidase: synthesis, biological evaluation, and structural determinants of MAO-A and MAO-B selectivity. Bioorg Med Chem 17:675-89 (2009)  
Target
Name:
Amine oxidase [flavin-containing] A
Synonyms:
AOFA_RAT Amine oxidase [flavin-containing] A Monoamine Oxidase Type A (MAO-A) Monoamine oxidase A (MAO-A) Monoamine oxidase type A (MAOA)
Type:
Enzyme
Mol. Mass.:
59515.21
Organism:
Rattus norvegicus (rat)
Description:
Residue:
526
  
Inhibitor
Name:
BDBM50247672
Synonyms:
2-[1'-Phenyl-3'-(4-methylphenyl)-2'-propenylidene]hydrazine-3-methyl)-4(3H)-quinazolinone | CHEMBL454170
Type:
Small organic molecule
Emp. Form.:
C25H22N4O
Mol. Mass.:
394.4684
SMILES:
Cc1ccc(CC=C(N=Nc2nc3ccccc3c(=O)n2C)c2ccccc2)cc1
: