Target
RAC-alpha serine/threonine-protein kinase
Ligand
BDBM50256715
Substrate
Meas. Tech.
ChEMBL_518711 (CHEMBL939833)
IC50
27±n/a nM
Citation
 Li, YLiang, JSiu, THu, ERossi, MABarnett, SFDefeo-Jones, DJones, RERobinson, RGLeander, KHuber, HEMittal, SCosford, NPrasit, P Allosteric inhibitors of Akt1 and Akt2: discovery of [1,2,4]triazolo[3,4-f][1,6]naphthyridines with potent and balanced activity. Bioorg Med Chem Lett 19:834-6 (2009)  
Target
Name:
RAC-alpha serine/threonine-protein kinase
Synonyms:
AKT phosphorylation (p-AKT) AKT1/PPP1CA C-AKT PKB alpha Protein kinase B Protein kinase B (Akt 1) Protein kinase B alpha Proto-oncogene Akt (Akt1) Proto-oncogene c-Akt (AKT1) RAC-PK-alpha RAC-alpha serine/threonine-protein kinase (AKT1) | RAC-alpha serine/threonine-protein kinase (pAKT)
Type:
Enzyme
Mol. Mass.:
55681.25
Organism:
Homo sapiens (Human)
Description:
P31749
Residue:
480
  
Inhibitor
Name:
BDBM50256715
Synonyms:
9-phenyl-8-(4-((4-(5-(pyridin-2-yl)-1H-1,2,4-triazol-3-yl)piperidin-1-yl)methyl)phenyl)-[1,2,4]triazolo[3,4-f][1,6]naphthyridin-3-ol | CHEMBL506077
Type:
Small organic molecule
Emp. Form.:
C34H29N9O
Mol. Mass.:
579.6538
SMILES:
O=c1[nH]nc2c3cc(-c4ccccc4)c(nc3ccn12)-c1ccc(CN2CCC(CC2)c2nnc([nH]2)-c2ccccn2)cc1
: