Target
Insulin receptor
Ligand
BDBM50256480
Substrate
Meas. Tech.
ChEMBL_519651 (CHEMBL946778)
IC50
19±n/a nM
Citation
 Emmitte, KAWilson, BJBaum, EWEmerson, HKKuntz, KWNailor, KESalovich, JMSmith, SCCheung, MGerding, RMStevens, KLUehling, DEMook, RAMoorthy, GSDickerson, SHHassell, AMLeesnitzer, MAShewchuk, LMGroy, ARowand, JLAnderson, KAtkins, CLYang, JSabbatini, PKumar, R Discovery and optimization of imidazo[1,2-a]pyridine inhibitors of insulin-like growth factor-1 receptor (IGF-1R). Bioorg Med Chem Lett 19:1004-8 (2009)  
Target
Name:
Insulin receptor
Synonyms:
INSR INSR_HUMAN Insulin receptor beta subunit
Type:
Receptor Tyrosine Kinase
Mol. Mass.:
156322.60
Organism:
Homo sapiens (Human)
Description:
P06213
Residue:
1382
  
Inhibitor
Name:
BDBM50256480
Synonyms:
CHEMBL466397 | N-(2,6-difluorophenyl)-5-(3-(2-(5-ethyl-2-methoxy-4-(4-(4-(methylsulfonyl)piperazin-1-yl)piperidin-1-yl)phenylamino)pyrimidin-4-yl)imidazo[1,2-a]pyridin-2-yl)-2-methoxybenzamide
Type:
Small organic molecule
Emp. Form.:
C44H47F2N9O5S
Mol. Mass.:
851.963
SMILES:
CCc1cc(Nc2nccc(n2)-c2c(nc3ccccn23)-c2ccc(OC)c(c2)C(=O)Nc2c(F)cccc2F)c(OC)cc1N1CCC(CC1)N1CCN(CC1)S(C)(=O)=O
: