Target
Platelet-derived growth factor receptor beta
Ligand
BDBM50265676
Substrate
Meas. Tech.
ChEMBL_559890 (CHEMBL1011001)
IC50
1±n/a nM
Citation
 Renhowe, PAPecchi, SShafer, CMMachajewski, TDJazan, EMTaylor, CAntonios-McCrea, WMcBride, CMFrazier, KWiesmann, MLapointe, GRFeucht, PHWarne, RLHeise, CCMenezes, DAardalen, KYe, HHe, MLe, VVora, JJansen, JMWernette-Hammond, MEHarris, AL Design, structure-activity relationships and in vivo characterization of 4-amino-3-benzimidazol-2-ylhydroquinolin-2-ones: a novel class of receptor tyrosine kinase inhibitors. J Med Chem 52:278-92 (2009)  
Target
Name:
Platelet-derived growth factor receptor beta
Synonyms:
Beta-type platelet-derived growth factor receptor CD140b antigen PDGF Receptor Substrate PDGFR PDGFR-1 PDGFRB PGFRB_HUMAN Platelet-derived growth factor receptor 1 Platelet-derived growth factor receptor beta (PDGFR-beta) Platelet-derived growth factor receptor beta (PDGFRbeta) | VHL/PDGFRB
Type:
Enzyme
Mol. Mass.:
123922.25
Organism:
Homo sapiens (Human)
Description:
P09619
Residue:
1106
  
Inhibitor
Name:
BDBM50265676
Synonyms:
CHEMBL495962 | N-(2-(4-Amino-2-oxo-1,2-dihydroquinolin-3-yl)-1H-benzo[d]imidazol-6-yl)-2-(dimethylamino)-N-methylacetamide
Type:
Small organic molecule
Emp. Form.:
C21H22N6O2
Mol. Mass.:
390.4384
SMILES:
CN(C)CC(=O)N(C)c1ccc2nc([nH]c2c1)-c1c(N)c2ccccc2[nH]c1=O
: