Target
Fibroblast growth factor receptor 1
Ligand
BDBM50265638
Substrate
Meas. Tech.
ChEMBL_559889 (CHEMBL1010125)
IC50
20±n/a nM
Citation
 Renhowe, PAPecchi, SShafer, CMMachajewski, TDJazan, EMTaylor, CAntonios-McCrea, WMcBride, CMFrazier, KWiesmann, MLapointe, GRFeucht, PHWarne, RLHeise, CCMenezes, DAardalen, KYe, HHe, MLe, VVora, JJansen, JMWernette-Hammond, MEHarris, AL Design, structure-activity relationships and in vivo characterization of 4-amino-3-benzimidazol-2-ylhydroquinolin-2-ones: a novel class of receptor tyrosine kinase inhibitors. J Med Chem 52:278-92 (2009)  
Target
Name:
Fibroblast growth factor receptor 1
Synonyms:
BFGFR Basic fibroblast growth factor receptor 1 (FGFR1) CEK FGFR-1 FGFR-1, (FL) FGFR1_HUMAN FLT2 Fibroblast growth factor receptor 1 (FGFR-1) Fms-like tyrosine kinase 2 N-sam bFGF-R | c-fgr
Type:
Receptor
Mol. Mass.:
91861.70
Organism:
Homo sapiens (Human)
Description:
P11362
Residue:
822
  
Inhibitor
Name:
BDBM50265638
Synonyms:
4-Amino-3-[6-(4-methyl(1,4-diazaperhydroepinyl))benzimidazol-2-yl]hydroquinolin-2-one | CHEMBL523071
Type:
Small organic molecule
Emp. Form.:
C22H24N6O
Mol. Mass.:
388.4656
SMILES:
CN1CCCN(CC1)c1ccc2nc([nH]c2c1)-c1c(N)c2ccccc2[nH]c1=O
: