Target
Cytochrome P450 2D6
Ligand
BDBM50255702
Substrate
Meas. Tech.
ChEMBL_515428 (CHEMBL1028887)
Ki
28.1±n/a nM
Citation
 Ponte-Sucre, AGulder, TWegehaupt, AAlbert, CRikanovic, CSchaeflein, LFrank, ASchultheis, MUnger, MHolzgrabe, UBringmann, GMoll, H Structure-activity relationship and studies on the molecular mechanism of leishmanicidal N,C-coupled arylisoquinolinium salts. J Med Chem 52:626-36 (2009)  
Target
Name:
Cytochrome P450 2D6
Synonyms:
CP2D6_HUMAN CYP2DL1 Cytochrome P450 2D6 (CYP2D6) P450-DB1
Type:
Protein
Mol. Mass.:
55774.82
Organism:
Homo sapiens (Human)
Description:
P10635
Residue:
497
  
Inhibitor
Name:
BDBM50255702
Synonyms:
CHEMBL520612 | N-(4'-Methyl phenyl)-6,8-dimethoxy-1,3-dimethylisoquinolinium tetrafluoroborate
Type:
Small organic molecule
Emp. Form.:
C20H22NO2
Mol. Mass.:
308.3936
SMILES:
COc1cc(OC)c2c(C)[n+](c(C)cc2c1)-c1ccc(C)cc1
: