Target
Aldo-keto reductase family 1 member A1
Ligand
BDBM7460
Substrate
Meas. Tech.
ChEMBL_515733 (CHEMBL1023735)
IC50
38400±n/a nM
Citation
 Carbone, VZhao, HTChung, REndo, SHara, AEl-Kabbani, O Correlation of binding constants and molecular modelling of inhibitors in the active sites of aldose reductase and aldehyde reductase. Bioorg Med Chem 17:1244-50 (2009)  
Target
Name:
Aldo-keto reductase family 1 member A1
Synonyms:
AK1A1_PIG ALR Aldehyde reductase
Type:
PROTEIN
Mol. Mass.:
36557.09
Organism:
Sus scrofa
Description:
ChEMBL_615076
Residue:
325
  
Inhibitor
Name:
BDBM7460
Synonyms:
2-(3,4-dihydroxyphenyl)-3,5,7-trihydroxy-4H-chromen-4-one 2-(3,4-dihydroxyphenyl)-3,5,7-trihydroxy-chromone;hydrate Quercetin Quercetin (21) US11021454, Compound Quercetin med.21724, Compound 4
Type:
Small organic molecule
Emp. Form.:
C15H10O7
Mol. Mass.:
302.2357
SMILES:
Oc1cc(O)c2c(c1)oc(-c1ccc(O)c(O)c1)c(O)c2=O
: