Target
Cathepsin S
Ligand
BDBM50255458
Substrate
Meas. Tech.
ChEMBL_515844 (CHEMBL1030543)
Ki
3.8±n/a nM
Citation
 Ayesa, SLindquist, CAgback, TBenkestock, KClasson, BHenderson, IHewitt, EJansson, KKallin, ASheppard, DSamuelsson, B Solid-phase parallel synthesis and SAR of 4-amidofuran-3-one inhibitors of cathepsin S: effect of sulfonamides P3 substituents on potency and selectivity. Bioorg Med Chem 17:1307-24 (2009)  
Target
Name:
Cathepsin S
Synonyms:
CATS_HUMAN Cathepsin S (Cat S) | cathepsin S preproprotein
Type:
Protein
Mol. Mass.:
37507.38
Organism:
Homo sapiens (Human)
Description:
P25774
Residue:
331
  
Inhibitor
Name:
BDBM50255458
Synonyms:
CHEMBL515588 | N-[1-(2S-Ethyl-4-oxo-tetrahydro-furan-3S-ylcarbamoyl)-2S-(1-methyl-cyclopentyl)-ethyl]-4-(2-fluoro-benzenesulfonylamino)-benzamide
Type:
Small organic molecule
Emp. Form.:
C28H34FN3O6S
Mol. Mass.:
559.649
SMILES:
CC[C@@H]1OCC(=O)[C@H]1NC(=O)[C@H](CC1(C)CCCC1)NC(=O)c1ccc(NS(=O)(=O)c2ccccc2F)cc1
: