Target
Nitric oxide synthase, brain
Ligand
BDBM50255307
Substrate
Meas. Tech.
ChEMBL_515883 (CHEMBL993937)
Ki
104±n/a nM
Citation
 Ji, HLi, HMartásek, PRoman, LJPoulos, TLSilverman, RB Discovery of highly potent and selective inhibitors of neuronal nitric oxide synthase by fragment hopping. J Med Chem 52:779-97 (2009)  
Target
Name:
Nitric oxide synthase, brain
Synonyms:
Bnos NC-NOS NOS type I nNOS Neuronal nitric oxide synthase Nitric Oxide Synthase, brain Nitric oxide synthase, brain (nNOS) Nitric-oxide synthase, brain (nNOS) Nos1 | Peptidyl-cysteine S-nitrosylase NOS1
Type:
Enzyme
Mol. Mass.:
160570.98
Organism:
Rattus norvegicus (rat)
Description:
Recombinant nNOS overexpressed in E. coli was used in enzyme assays.
Residue:
1429
  
Inhibitor
Name:
BDBM50255307
Synonyms:
CHEMBL480254 | N1-{(+/-)-4'-[(6''-amino-4''-methylpyridin-2''-yl)methyl]pyrrolidin-3-yl}-N2-(3'-chlorobenzyl)ethane-1,2-diamine tetrahydrochloride
Type:
Small organic molecule
Emp. Form.:
C20H28ClN5
Mol. Mass.:
373.923
SMILES:
Cc1cc(N)nc(C[C@H]2CNC[C@H]2NCCNCc2cccc(Cl)c2)c1
: