Target
Nitric oxide synthase, brain
Ligand
BDBM50255363
Substrate
Meas. Tech.
ChEMBL_515883 (CHEMBL993937)
Ki
24±n/a nM
Citation
 Ji, HLi, HMartásek, PRoman, LJPoulos, TLSilverman, RB Discovery of highly potent and selective inhibitors of neuronal nitric oxide synthase by fragment hopping. J Med Chem 52:779-97 (2009)  
Target
Name:
Nitric oxide synthase, brain
Synonyms:
Bnos NC-NOS NOS type I nNOS Neuronal nitric oxide synthase Nitric Oxide Synthase, brain Nitric oxide synthase, brain (nNOS) Nitric-oxide synthase, brain (nNOS) Nos1 | Peptidyl-cysteine S-nitrosylase NOS1
Type:
Enzyme
Mol. Mass.:
160570.98
Organism:
Rattus norvegicus (rat)
Description:
Recombinant nNOS overexpressed in E. coli was used in enzyme assays.
Residue:
1429
  
Inhibitor
Name:
BDBM50255363
Synonyms:
CHEMBL517995 US9090589, 7
Type:
Small organic molecule
Emp. Form.:
C21H31N5
Mol. Mass.:
353.5043
SMILES:
Cc1cc(N)nc(C[C@H]2CNC[C@H]2NCCNCCc2ccccc2)c1
: