Target
Coagulation factor X
Ligand
BDBM35743
Substrate
Meas. Tech.
ChEMBL_516017 (CHEMBL981506)
Ki
2.85±n/a nM
Citation
 Nagata, TYoshino, THaginoya, NYoshikawa, KNagamochi, MKobayashi, SKomoriya, SYokomizo, AMuto, RYamaguchi, MOsanai, KSuzuki, MKanno, H Discovery of N-[(1R,2S,5S)-2-{[(5-chloroindol-2-yl)carbonyl]amino}-5-(dimethylcarbamoyl)cyclohexyl]-5-methyl-4,5,6,7-tetrahydrothiazolo[5,4-c]pyridine-2-carboxamide hydrochloride: a novel, potent and orally active direct inhibitor of factor Xa. Bioorg Med Chem 17:1193-206 (2009)  
Target
Name:
Coagulation factor X
Synonyms:
Activated coagulation factor X (FXa) Coagulation factor X precursor F10 Factor X heavy chain Factor Xa Stuart-Prower factor
Type:
Enzyme
Mol. Mass.:
54726.60
Organism:
Homo sapiens (Human)
Description:
Residue:
488
  
Inhibitor
Name:
BDBM35743
Synonyms:
CHEMBL479863 | cis-1,2-diaminocyclohexane derivative, A
Type:
Small organic molecule
Emp. Form.:
C26H31ClN6O3S
Mol. Mass.:
543.081
SMILES:
CN(C)C(=O)[C@H]1CC[C@H](NC(=O)c2cc3cc(Cl)ccc3[nH]2)[C@@H](C1)NC(=O)c1nc2CCN(C)Cc2s1
: