Target
C-C chemokine receptor type 3
Ligand
BDBM50255219
Substrate
Meas. Tech.
ChEMBL_516086 (CHEMBL982456)
IC50
7±n/a nM
Citation
 Cherney, RJBrogan, JBMo, RLo, YCYang, GMiller, PBScherle, PAMolino, BFCarter, PHDecicco, CP Discovery of trisubstituted cyclohexanes as potent CC chemokine receptor 2 (CCR2) antagonists. Bioorg Med Chem Lett 19:597-601 (2009)  
Target
Name:
C-C chemokine receptor type 3
Synonyms:
C-C CKR-3 CC-CKR-3 CCR3 CD_antigen=CD193 CMKBR3 | Eosinophil eotaxin receptor
Type:
Enzyme
Mol. Mass.:
41053.88
Organism:
Homo sapiens (Human)
Description:
P51677
Residue:
355
  
Inhibitor
Name:
BDBM50255219
Synonyms:
(+/-)-benzyl-3-(4-(methylthio)benzamido)-4-(2-(3-(trifluoromethyl)benzamido)acetamido)cyclohexylcarbamate CHEMBL505722
Type:
Small organic molecule
Emp. Form.:
C32H33F3N4O5S
Mol. Mass.:
642.688
SMILES:
CSc1ccc(cc1)C(=O)NC1CC(CCC1NC(=O)CNC(=O)c1cccc(c1)C(F)(F)F)NC(=O)OCc1ccccc1
: