Target
Baculoviral IAP repeat-containing protein 2
Ligand
BDBM26223
Substrate
Meas. Tech.
ChEMBL_516265 (CHEMBL985935)
Ki
0.68±n/a nM
Citation
 Sun, WNikolovska-Coleska, ZQin, DSun, HYang, CYBai, LQiu, SWang, YMa, DWang, S Design, synthesis, and evaluation of potent, nonpeptidic mimetics of second mitochondria-derived activator of caspases. J Med Chem 52:593-6 (2009)  
Target
Name:
Baculoviral IAP repeat-containing protein 2
Synonyms:
API1 BIRC2_HUMAN Cellular inhibitor of apoptosis 1 MIHB | RNF48
Type:
Protein
Mol. Mass.:
69900.47
Organism:
Homo sapiens (Human)
Description:
Q13490
Residue:
618
  
Inhibitor
Name:
BDBM26223
Synonyms:
(3S,6S,10aS)-6-[(2S)-2-(methylamino)propanamido]-5-oxo-N-[(1R)-1,2,3,4-tetrahydronaphthalen-1-yl]-decahydropyrrolo[1,2-a]azocine-3-carboxamide bicyclic Smac peptide mimetic, 25
Type:
Small organic molecule
Emp. Form.:
C25H36N4O3
Mol. Mass.:
440.5783
SMILES:
CN[C@@H](C)C(=O)N[C@H]1CCCC[C@H]2CC[C@H](N2C1=O)C(=O)N[C@@H]1CCCc2ccccc12
: