Target
D(4) dopamine receptor
Ligand
BDBM50185473
Substrate
Meas. Tech.
ChEMBL_541031 (CHEMBL1024731)
Ki
5.3±n/a nM
Citation
 Sikazwe, DMNkansah, NTAltundas, RZhu, XYRoth, BLSetola, VAblordeppey, SY Synthesis and evaluation of ligands for D2-like receptors: the role of common pharmacophoric groups. Bioorg Med Chem 17:1716-23 (2009)  
Target
Name:
D(4) dopamine receptor
Synonyms:
D(2C) dopamine receptor DOPAMINE D4.2 DRD4 Dopamine D4 receptor
Type:
Enzyme
Mol. Mass.:
48373.19
Organism:
Homo sapiens (Human)
Description:
P21917
Residue:
419
  
Inhibitor
Name:
BDBM50185473
Synonyms:
4-(3-(4-chlorophenyl)-3-hydroxy-8-aza-bicyclo[3.2.1]octan-8-yl)-1-(4-fluorophenyl)butan-1-one 4-[3-(4-Chlorophenyl)-3-hydroxy-8-azabicyclo[3.2.1]oct-8-yl]-1-(4-fluorophenyl)butan-1-one | CHEMBL210578
Type:
Small organic molecule
Emp. Form.:
C23H25ClFNO2
Mol. Mass.:
401.902
SMILES:
OC1(CC2CCC(C1)N2CCCC(=O)c1ccc(F)cc1)c1ccc(Cl)cc1
: