Target
Glutamate receptor ionotropic, NMDA 2B
Ligand
BDBM50007674
Substrate
Meas. Tech.
ChEMBL_540808 (CHEMBL1034049)
IC50
21±n/a nM
Citation
 Gitto, RDe Luca, LFerro, SCitraro, RDe Sarro, GCosta, LCiranna, LChimirri, A Development of 3-substituted-1H-indole derivatives as NR2B/NMDA receptor antagonists. Bioorg Med Chem 17:1640-7 (2009)  
Target
Name:
Glutamate receptor ionotropic, NMDA 2B
Synonyms:
GluN2B Grin2b NMDA receptor subunit N2B (GluN2B) NMDE2_RAT | NR2B
Type:
Protein
Mol. Mass.:
166077.66
Organism:
Rattus norvegicus (Rat)
Description:
Q00960
Residue:
1482
  
Inhibitor
Name:
BDBM50007674
Synonyms:
(+)-erythro 4-[2-(4-Benzyl-piperidin-1-yl)-1-hydroxy-propyl]-phenol 4-[(1R,2S)-2-(4-Benzyl-piperidin-1-yl)-1-hydroxy-propyl]-phenol 4-[2-(4-Benzyl-piperidin-1-yl)-1-hydroxy-propyl]-phenol Ifenprodil | Ifenprodil,(+/-)
Type:
Small organic molecule
Emp. Form.:
C21H27NO2
Mol. Mass.:
325.4446
SMILES:
C[C@@H]([C@H](O)c1ccc(O)cc1)N1CCC(Cc2ccccc2)CC1
: