Target
Bifunctional epoxide hydrolase 2
Ligand
BDBM50276726
Substrate
Meas. Tech.
ChEMBL_540974 (CHEMBL1028131)
IC50
93±n/a nM
Citation
 Anandan, SKDo, ZNWebb, HKPatel, DVGless, RD Non-urea functionality as the primary pharmacophore in soluble epoxide hydrolase inhibitors. Bioorg Med Chem Lett 19:1066-70 (2009)  
Target
Name:
Bifunctional epoxide hydrolase 2
Synonyms:
Cytosolic epoxide hydrolase 2 EPHX2 HYES_HUMAN Soluble epoxide hydrolase (sEH) | epoxide hydrolase 2, cytoplasmic
Type:
Enzyme
Mol. Mass.:
62613.07
Organism:
Homo sapiens (Human)
Description:
P34913
Residue:
555
  
Inhibitor
Name:
BDBM50276726
Synonyms:
CHEMBL461894 | N-(3-(3-morpholinopropoxy)phenyl)-4-(trifluoromethyl)benzamide
Type:
Small organic molecule
Emp. Form.:
C21H23F3N2O3
Mol. Mass.:
408.4141
SMILES:
FC(F)(F)c1ccc(cc1)C(=O)Nc1cccc(OCCCN2CCOCC2)c1
: