Target
Histone deacetylase 3
Ligand
BDBM50248476
Substrate
Meas. Tech.
ChEMBL_543448 (CHEMBL1015996)
Ki
13±n/a nM
Citation
 Wang, HYu, NSong, HChen, DZou, YDeng, WLye, PLChang, JNg, MSun, ETSangthongpitag, KWang, XWu, XKhng, HHFang, LGoh, SKOng, WCBonday, ZStünkel, WPoulsen, AEntzeroth, M N-Hydroxy-1,2-disubstituted-1H-benzimidazol-5-yl acrylamides as novel histone deacetylase inhibitors: design, synthesis, SAR studies, and in vivo antitumor activity. Bioorg Med Chem Lett 19:1403-8 (2009)  
Target
Name:
Histone deacetylase 3
Synonyms:
HD3 HDAC3_HUMAN Human HDAC3 SMAP45
Type:
Enzyme
Mol. Mass.:
48829.55
Organism:
Homo sapiens (Human)
Description:
O15379
Residue:
428
  
Inhibitor
Name:
BDBM50248476
Synonyms:
CHEMBL491316 N-hydroxy-3-[2-phenethyl-1-(2-pyrrolidin-1-ylethyl)-1H-benzimidazol-5-yl]acrylamide US10201527, Compound 72 US8551988, 72
Type:
Small organic molecule
Emp. Form.:
C24H28N4O2
Mol. Mass.:
404.5047
SMILES:
ONC(=O)\C=C\c1ccc2n(CCN3CCCC3)c(CCc3ccccc3)nc2c1
: