Target
Potassium voltage-gated channel subfamily KQT member 1
Ligand
BDBM50279453
Substrate
Meas. Tech.
ChEMBL_545265 (CHEMBL1020711)
IC50
27±n/a nM
Citation
 Du, LLi, MYang, QTang, YYou, QXia, L Molecular hybridization, synthesis, and biological evaluation of novel chroman I(Kr) and I(Ks) dual blockers. Bioorg Med Chem Lett 19:1477-80 (2009)  
Target
Name:
Potassium voltage-gated channel subfamily KQT member 1
Synonyms:
IKs producing slow voltage-gated potassium channel subunit alpha KvLQT1 KCNQ1_CAVPO KVLQT1 Voltage-gated potassium channel subunit Kv7.1
Type:
PROTEIN
Mol. Mass.:
74450.11
Organism:
Cavia porcellus
Description:
ChEMBL_88894
Residue:
671
  
Inhibitor
Name:
BDBM50279453
Synonyms:
1-(6-ethoxy-2,3-dihydrochromen-4-ylideneamino)-3-(3-(4-methylpiperazin-1-yl)propyl)imidazolidine-2,4-dione | CHEMBL487756
Type:
Small organic molecule
Emp. Form.:
C22H31N5O4
Mol. Mass.:
429.5126
SMILES:
CCOc1ccc2OCCC(=Nn3cc(O)n(CCCN4CCN(C)CC4)c3=O)c2c1
: