Target
Thrombopoietin receptor
Ligand
BDBM50247935
Substrate
Meas. Tech.
ChEMBL_543527 (CHEMBL1019476)
EC50
57±n/a nM
Citation
 Munchhof, MJAntipas, ASBlumberg, LCBrissette, WHBrown, MFCasavant, JMDoty, JLDriscoll, JHarris, TMWolf-Gouveia, LAJones, CSLi, QLinde, RGLira, PDMarfat, AMcElroy, EMitton-Fry, MMcCurdy, SPReiter, LARipp, SLShavnya, AThomasco, LMTrevena, KA The identification of orally bioavailable thrombopoietin agonists. Bioorg Med Chem Lett 19:1428-30 (2009)  
Target
Name:
Thrombopoietin receptor
Synonyms:
C-mpl MPL TPO-R TPOR_HUMAN
Type:
PROTEIN
Mol. Mass.:
71243.48
Organism:
Homo sapiens (Human)
Description:
ChEMBL_535587
Residue:
635
  
Inhibitor
Name:
BDBM50247935
Synonyms:
(R)-2-(3-chloro-5-(4-(2-fluoro-3-(trifluoromethyl)phenyl)thiazol-2-ylcarbamoyl)pyridin-2-ylamino)propanoic acid | CHEMBL524116
Type:
Small organic molecule
Emp. Form.:
C19H13ClF4N4O3S
Mol. Mass.:
488.843
SMILES:
C[C@@H](Nc1ncc(cc1Cl)C(=O)Nc1nc(cs1)-c1cccc(c1F)C(F)(F)F)C(O)=O
: