Target
Thrombopoietin receptor
Ligand
BDBM50248022
Substrate
Meas. Tech.
ChEMBL_543527 (CHEMBL1019476)
EC50
>10000±n/a nM
Citation
 Munchhof, MJAntipas, ASBlumberg, LCBrissette, WHBrown, MFCasavant, JMDoty, JLDriscoll, JHarris, TMWolf-Gouveia, LAJones, CSLi, QLinde, RGLira, PDMarfat, AMcElroy, EMitton-Fry, MMcCurdy, SPReiter, LARipp, SLShavnya, AThomasco, LMTrevena, KA The identification of orally bioavailable thrombopoietin agonists. Bioorg Med Chem Lett 19:1428-30 (2009)  
Target
Name:
Thrombopoietin receptor
Synonyms:
C-mpl MPL TPO-R TPOR_HUMAN
Type:
PROTEIN
Mol. Mass.:
71243.48
Organism:
Homo sapiens (Human)
Description:
ChEMBL_535587
Residue:
635
  
Inhibitor
Name:
BDBM50248022
Synonyms:
5-chloro-N-(4-(2-fluoro-3-(trifluoromethyl)phenyl)thiazol-2-yl)-6-(piperidin-1-yl)nicotinamide | CHEMBL455445
Type:
Small organic molecule
Emp. Form.:
C21H17ClF4N4OS
Mol. Mass.:
484.897
SMILES:
Fc1c(cccc1C(F)(F)F)-c1csc(NC(=O)c2cnc(N3CCCCC3)c(Cl)c2)n1
: