Target
Thrombopoietin receptor
Ligand
BDBM50248069
Substrate
Meas. Tech.
ChEMBL_543527 (CHEMBL1019476)
EC50
138±n/a nM
Citation
 Munchhof, MJAntipas, ASBlumberg, LCBrissette, WHBrown, MFCasavant, JMDoty, JLDriscoll, JHarris, TMWolf-Gouveia, LAJones, CSLi, QLinde, RGLira, PDMarfat, AMcElroy, EMitton-Fry, MMcCurdy, SPReiter, LARipp, SLShavnya, AThomasco, LMTrevena, KA The identification of orally bioavailable thrombopoietin agonists. Bioorg Med Chem Lett 19:1428-30 (2009)  
Target
Name:
Thrombopoietin receptor
Synonyms:
C-mpl MPL TPO-R TPOR_HUMAN
Type:
PROTEIN
Mol. Mass.:
71243.48
Organism:
Homo sapiens (Human)
Description:
ChEMBL_535587
Residue:
635
  
Inhibitor
Name:
BDBM50248069
Synonyms:
1-(3-cyano-5-(4-(2-fluoro-3-(trifluoromethyl)phenyl)thiazol-2-ylcarbamoyl)pyridin-2-yl)piperidine-4-carboxylic acid | CHEMBL461975
Type:
Small organic molecule
Emp. Form.:
C23H17F4N5O3S
Mol. Mass.:
519.471
SMILES:
OC(=O)C1CCN(CC1)c1ncc(cc1C#N)C(=O)Nc1nc(cs1)-c1cccc(c1F)C(F)(F)F
: