Target
Hexokinase-4
Ligand
BDBM50186320
Substrate
Meas. Tech.
ChEMBL_565879 (CHEMBL959302)
EC50
6300±n/a nM
Citation
 Nishimura, TIino, TMitsuya, MBamba, MWatanabe, HTsukahara, DKamata, KSasaki, KOhyama, SHosaka, HFutamura, MNagata, YEiki, J Identification of novel and potent 2-amino benzamide derivatives as allosteric glucokinase activators. Bioorg Med Chem Lett 19:1357-60 (2009)  
Target
Name:
Hexokinase-4
Synonyms:
GCK Glucokinase (GK) HK IV HXK4_HUMAN Hexokinase-D
Type:
Enzyme
Mol. Mass.:
52175.81
Organism:
Homo sapiens (Human)
Description:
P35557
Residue:
465
  
Inhibitor
Name:
BDBM50186320
Synonyms:
3-chloro-N-(4-methylthiazol-2-yl)benzamide | CHEMBL212529
Type:
Small organic molecule
Emp. Form.:
C11H9ClN2OS
Mol. Mass.:
252.72
SMILES:
Cc1csc(NC(=O)c2cccc(Cl)c2)n1
: