Target
Vascular endothelial growth factor receptor 1
Ligand
BDBM50248494
Substrate
Meas. Tech.
ChEMBL_565916 (CHEMBL960811)
IC50
66±n/a nM
Citation
 Kiselyov, ASSemenova, MSemenov, VV (1,2,3-Triazol-4-yl)benzenamines: synthesis and activity against VEGF receptors 1 and 2. Bioorg Med Chem Lett 19:1344-8 (2009)  
Target
Name:
Vascular endothelial growth factor receptor 1
Synonyms:
FLT FRT Fms-like tyrosine kinase 1 Tyrosine-protein kinase FRT VEGFR-1 VGFR1_HUMAN Vascular endothelial growth factor receptor 1 (FLT1) Vascular endothelial growth factor receptor 1 and 2 (Flt-1 and KDR) Vascular permeability factor receptor vascular endothelial growth factor/vascular permeability factor receptor
Type:
Receptor Tyrosine Kinase
Mol. Mass.:
150800.23
Organism:
Homo sapiens (Human)
Description:
P17948
Residue:
1338
  
Inhibitor
Name:
BDBM50248494
Synonyms:
CHEMBL490968 | N-(Pyridin-4-ylmethyl)-2-(1-(3-(trifluoromethyl)phenyl)-1H-1,2,3-triazol-4-yl)benzenamine
Type:
Small organic molecule
Emp. Form.:
C21H16F3N5
Mol. Mass.:
395.3804
SMILES:
FC(F)(F)c1cccc(c1)-n1cc(nn1)-c1ccccc1NCc1ccncc1
: