Target
Neurotensin receptor type 1
Ligand
BDBM50248080
Substrate
Meas. Tech.
ChEMBL_566215 (CHEMBL963296)
EC50
986±n/a nM
Citation
 Thomas, JBNavarro, HWarner, KRGilmour, B The identification of nonpeptide neurotensin receptor partial agonists from the potent antagonist SR48692 using a calcium mobilization assay. Bioorg Med Chem Lett 19:1438-41 (2009)  
Target
Name:
Neurotensin receptor type 1
Synonyms:
Dopamine receptor D2L/neurotensin receptor NTS1 NTRR Neurotensin receptor 1 | neurotensin receptor type 1
Type:
PROTEIN
Mol. Mass.:
46278.89
Organism:
Homo sapiens (Human)
Description:
ChEMBL_1453811
Residue:
418
  
Inhibitor
Name:
BDBM50248080
Synonyms:
(2R)-2-(1-(7-chloroquinolin-4-yl)-5-(2,6-dimethoxyphenyl)-1H-pyrazole-3-carboxamido)-4-methylpentanoic acid | CHEMBL463227
Type:
Small organic molecule
Emp. Form.:
C27H27ClN4O5
Mol. Mass.:
522.98
SMILES:
COc1cccc(OC)c1-c1cc(nn1-c1ccnc2cc(Cl)ccc12)C(=O)N[C@H](CC(C)C)C(O)=O
: