Target
C-X-C chemokine receptor type 1
Ligand
BDBM50248335
Substrate
Meas. Tech.
ChEMBL_566225 (CHEMBL963306)
Ki
16±n/a nM
Citation
 Biju, PTaveras, AGDwyer, MPYu, YChao, JHipkin, RWFan, XRindgen, DFine, JLundell, D Fluoroalkyl alpha side chain containing 3,4-diamino-cyclobutenediones as potent and orally bioavailable CXCR2-CXCR1 dual antagonists. Bioorg Med Chem Lett 19:1431-3 (2009)  
Target
Name:
C-X-C chemokine receptor type 1
Synonyms:
C-X-C chemokine receptor type 1 (CXCR-1) CMKAR1 CXCR1_HUMAN Interleukin-8 receptor A | Interleukin-8 receptors, CXCR1/CXCR2
Type:
Enzyme
Mol. Mass.:
39803.83
Organism:
Homo sapiens (Human)
Description:
P25024
Residue:
350
  
Inhibitor
Name:
BDBM50248335
Synonyms:
3-(2-((1S,2S)-2-fluoro-1-(5-methylfuran-2-yl)propylamino)-3,4-dioxocyclobut-1-enylamino)-2-hydroxy-N,N-dimethylbenzamide | CHEMBL514001
Type:
Small organic molecule
Emp. Form.:
C21H22FN3O5
Mol. Mass.:
415.4149
SMILES:
C[C@H](F)[C@@H](Nc1c(Nc2cccc(C(=O)N(C)C)c2O)c(=O)c1=O)c1ccc(C)o1
: