Target
Neuronal acetylcholine receptor subunit alpha-7
Ligand
BDBM50413329
Substrate
Meas. Tech.
ChEMBL_566261 (CHEMBL953564)
EC50
15.85±n/a nM
Citation
 Enz, AFeuerbach, DFrederiksen, MUGentsch, CHurth, KMüller, WNozulak, JRoy, BL Gamma-lactams--a novel scaffold for highly potent and selective alpha 7 nicotinic acetylcholine receptor agonists. Bioorg Med Chem Lett 19:1287-91 (2009)  
Target
Name:
Neuronal acetylcholine receptor subunit alpha-7
Synonyms:
ACHA7_HUMAN Cholinergic, Nicotinic Alpha7 Neuronal acetylcholine receptor protein alpha-7 subunit Nicotinic acetylcholine receptor alpha-7 (alpha7 nAChR)
Type:
Mol. Mass.:
56448.33
Organism:
Homo sapiens (Human)
Description:
CHRNA7 (NACHRA7)
Residue:
502
  
Inhibitor
Name:
BDBM50413329
Synonyms:
CHEMBL459904
Type:
Small organic molecule
Emp. Form.:
C20H26N2O
Mol. Mass.:
310.4332
SMILES:
CN1C(CC(CN2CCCCC2)C1=O)C#Cc1ccccc1C
: