Target
Hepatocyte growth factor receptor
Ligand
BDBM50248558
Substrate
Meas. Tech.
ChEMBL_566634 (CHEMBL960948)
IC50
28±n/a nM
Citation
 Raeppel, SClaridge, SSaavedra, OGaudette, FZhan, LMannion, MZhou, NRaeppel, FGranger, MCIsakovic, LDéziel, RNguyen, HBeaulieu, NBeaulieu, CDupont, IRobert, MFLefebvre, SDubay, MRahil, JWang, JSte-Croix, HRobert Macleod, ABesterman, JVaisburg, A N-(3-fluoro-4-(2-arylthieno[3,2-b]pyridin-7-yloxy)phenyl)-2-oxo-3-phenylimidazolidine-1-carboxamides: a novel series of dual c-Met/VEGFR2 receptor tyrosine kinase inhibitors. Bioorg Med Chem Lett 19:1323-8 (2009)  
Target
Name:
Hepatocyte growth factor receptor
Synonyms:
Hepatocyte growth factor receptor Hepatocyte growth factor receptor (c-MET) MET Met proto-oncogene (hepatocyte growth factor receptor) Tyrosine-protein kinase Met (c-Met) c-Met kinase
Type:
Protein
Mol. Mass.:
155559.73
Organism:
Homo sapiens (Human)
Description:
P08581
Residue:
1390
  
Inhibitor
Name:
BDBM50248558
Synonyms:
CHEMBL465131 | N-(3-fluoro-4-(2-(1-methyl-1H-imidazol-4-yl)thieno[3,2-b]pyridin-7-yloxy)phenyl)-N-phenylcyclopropane-1,1-dicarboxamide
Type:
Small organic molecule
Emp. Form.:
C28H22FN5O3S
Mol. Mass.:
527.569
SMILES:
Cn1cnc(c1)-c1cc2nccc(Oc3ccc(NC(=O)C4(CC4)C(=O)Nc4ccccc4)cc3F)c2s1
: