Target
Fatty acid-binding protein, adipocyte
Ligand
BDBM50247992
Substrate
Meas. Tech.
ChEMBL_566942 (CHEMBL964125)
IC50
430±n/a nM
Citation
 Barf, TLehmann, FHammer, KHaile, SAxen, EMedina, CUppenberg, JSvensson, SRondahl, LLundbäck, T N-Benzyl-indolo carboxylic acids: Design and synthesis of potent and selective adipocyte fatty-acid binding protein (A-FABP) inhibitors. Bioorg Med Chem Lett 19:1745-8 (2009)  
Target
Name:
Fatty acid-binding protein, adipocyte
Synonyms:
A-FABP ALBP FABP4 Fatty acid binding protein adipocyte Fatty acid-binding protein 4 (FABP4)
Type:
Enzyme
Mol. Mass.:
14719.23
Organism:
Homo sapiens (Human)
Description:
P15090
Residue:
132
  
Inhibitor
Name:
BDBM50247992
Synonyms:
5-propyl-5,6,7,8,9,10-hexahydrocyclohepta[b]indole-4-carboxylic acid | CHEMBL516469
Type:
Small organic molecule
Emp. Form.:
C17H21NO2
Mol. Mass.:
271.3541
SMILES:
CCCn1c2CCCCCc2c2cccc(C(O)=O)c12
: